Organization,Salutation,First,Middle,Last,Generational,Credentials,"Preferred Name",Title,Phone,"Phone Extension",Fax,Email,Address,City,State,Zip,"Billing Address","Billing Zip"
Adamsville,Mr.,Tom,,Evans,,,"Tom Evans","Parks and Recreation Director, Adamsville","(731) 926-5675",,,citypark@cityofadamsville.com,"231 East Main Street, P.O. Box 301",Adamsville,TN,38310,,
Alcoa,Mr.,Joe,,Huff,,,"Joe Huff","Parks and Recreation Director, Maryville; Parks and Recreation Director, Alcoa","(865) 983-9244",,"(865) 983-8831",,"400 West Broadway",Maryville,TN,37801-4710,,
Arlington,Mr.,Lee,,Upchurch,,,"Lee Upchurch","Parks and Recreation Director, Arlington","(901) 867-4980",,,lupchurch@townofarlington.org,"5854 Airline Road, PO BOX 507",Arlington,TN,38002,,
Athens,,VACANT,,VACANT,,,VACANT,"Parks and Recreation Director, Athens",,,,,"815 North Jackson Street",Athens,TN,37303,,
Atoka,Ms.,Dorothy,,Isbell,,,"Dorothy Isbell","Parks and Recreation Director, Atoka","(901) 837-5300",,"(901) 837-0028",disbell@townofatoka.com,"334 Atoka Munford Avenue",Atoka,TN,38004,,
Auburntown,Mr.,Roger,,Turney,,,"Roger Turney","Parks and Recreation Director, Auburntown","(615) 464-4210",,,,"City Hall, PO Box 38",Auburntown,TN,37016,,
Bartlett,Mr.,Paul,,Wright,,,"Paul Wright","Parks and Recreation Director, Bartlett","(901) 385-5590",,"(901) 385-6673",pwright@cityofbartlett.org,"5868 Stage Road",Bartlett,TN,38134,,
Bolivar,Mr.,Anthony,,Ford,,,"Anthony Ford","Parks and Recreation Director, Bolivar","(731) 658-7529",,,aford.cityofbolivar@gmail.com,"City Hall, 211 North Washington Street",Bolivar,TN,38008,,
Brentwood,Mr.,Dave,M.,Bunt,,,"Dave M. Bunt","Parks and Recreation Director, Brentwood","(615) 371-2208",,"(615) 371-2225",dave.bunt@brentwoodtn.gov,"5211 Maryland Way, P.O. Box 788",Brentwood,TN,37024-0788,,
Bristol,Mr.,Mike,,Mains,,,"Mike Mains","Parks and Recreation Director, Bristol","(423) 764-4023",,"(423) 989-5624",mmains@bristoltn.org,"325 McDowell Street; P.O. Box 1189",Bristol,TN,37621-1189,,
Brownsville,Ms.,Undrea,,Johnson,,,"Undrea Johnson","Parks and Recreation Director, Brownsville","(731) 772-6693",,,ujohnson@brownsvilletn.gov,"111 North Washington, P.O. Box 449",Brownsville,TN,38012,,
Burns,Mr.,Daryl,,Grove,,,"Daryl ""Rusty"" Grove","Parks and Recreation Director, Burns","(615) 948-2221",,,,"P.O. Box 36",Burns,TN,37029,,
Camden,Mr.,Kevin,Tilmon,Johnson,,,"Kevin T Johnson","Street Department Superintendent, Camden; Sanitation Manager, Camden; Parks and Recreation Superintendent, Camden","(731) 584-4041",,,Kj488844@gmail.com,"110 Highway 641 South, P.O. Box 779",Camden,TN,38320,,
Charlotte,Mr.,William,R.,Davis,,,"William ""Bill"" R. Davis","Parks and Recreation Director, Charlotte","(615) 789-4184",,"(615) 789-9273",,"22 Court Square",Charlotte,TN,37036,,
Clarksville,Mrs.,Jennifer,,Letourneau,,,"Jennifer Letourneau","Parks and Recreation Director, Clarksville","(931) 645-7476",,"(931) 553-2432",jennifer.letourneau@cityofclarksville.com,"1 Public Square, PO Box 928",Clarksville,TN,37040,,
Cleveland,Ms.,Patti,,Petitt,,,"Patti Petitt","Parks and Recreation Director, Cleveland","(423) 479-4129",,"(423) 559-3366",ppetitt@clevelandtn.gov,"190 Church Street NE, P.O. Box 1519",Cleveland,TN,37364-1519,,
Clifton,Mr.,Eddie,,Simmons,,,"Eddie Simmons","Parks and Recreation Director, Clifton","(931) 676-3370",,,esimmons@cityofclifton.com,"142 Main Street, P.O. Box 192",Clifton,TN,38425,,
Clinton,Mr.,Jason,,Brown,,,"Jason Brown","Parks and Recreation Director, Clinton","(865) 457-0642",,"(865) 259-1167",jbrown@cityofclintontn.net,"101 Hicks Street",Clinton,TN,37716,,
Collierville,Mr.,Greg,,Clark,,,"Greg Clark","Parks and Recreation Director, Collierville","(901) 853-3225",,,gclark@colliervilletn.gov,"500 Poplar View Parkway",Collierville,TN,38017-3440,,
Columbia,Mr.,Mack,,Reagan,,,"Mack Reagan","Parks and Recreation Director, Columbia","(931) 388-8119",,"(931) 380-2767",,"821 West 9th Street",Columbia,TN,38401,,
Covington,Mrs.,Molly,Griffin,Glass,,,"Molly Griffin Glass","Parks and Recreation Director, Covington","(901) 504-8982",,"(901) 476-1214",mglass@covingtontn.com,"790 Bert Johnston Ave.",Covington,TN,38019,,
Dayton,Mr.,Will,,Tholken,,,"Will Tholken","Parks and Recreation Director, Dayton","(423) 775-8418",,,w.tholken@daytontn.net,"399 First Avenue",Dayton,TN,37321,"P.O. Box 226",37321
Dover,Mr.,Jeff,,Brigham,,,"Jeff Brigham","Parks Dept. Supervisor, Dover","(931) 232-5907",,,,"P.O. Box 447",Dover,TN,37058,,
Dresden,Mr.,Joey,,Winstead,,,"Joey Winstead","Parks and Recreation Director, Dresden","(731) 364-2270",,,,"589 Evergreen Street",Dresden,TN,38225,,
Dyersburg,Mr.,James,E.,Johnson,,,"James E. Johnson","Parks and Recreation Director, Dyersburg","(731) 288-2560",,,jjohnson@dyersburgtn.gov,"425 West Court Street",Dyersburg,TN,38025-1358,"PO Box 1358",38025
Eagleville,Mr.,Kevin,,York,,,"Kevin York","Park Superintendent/Public Works, Eagleville; Maintenance, Eagleville","(615) 274-2922",,,kyork@eaglevilletn.com,"108 South Main Street; PO Box 68",Eagleville,TN,37060,"PO Box 68",37060
"East Ridge",Ms.,Shawnna,,Skiles,,,"Shawnna Skiles","Parks and Recreation Director, East Ridge","(423) 867-7711",,,sskiles@eastridgetn.gov,"1517 Tombras Avenue","East Ridge",TN,37412,,
Erwin,Mr.,Marlin,,Hensley,,,"Marlin Hensley","Parks Dept. Supervisor, Erwin","(423) 743-6231",,"(423) 743-3983",,"211 North Main,P. O. Box 59",Erwin,TN,37650,,
Etowah,Mr.,Bryan,,Dalton,,,"Bryan Dalton","Parks and Recreation Manager, Etowah","(423) 263-2202",,,,"Etowah City Hall, 701 Tennessee Ave.",Etowah,TN,37331-1345,,
Fairview,Mr.,Keith,,Paisley,,,"Keith Paisley","Park Director, Fairview","(615) 387-6068",,,kpaisley@fairview-tn.org,"7100 City Center Way, P.O. Box 69",Fairview,TN,37062,,
Farragut,Ms.,Sue,C.,Stuhl,,,"Sue C. Stuhl","Parks and Recreation Director, Farragut","(865) 966-7057",,,sstuhl@townoffarragut.org,"11408 Municipal Center Drive",Farragut,TN,37934,,
Fayetteville,Mr.,Nathan,,Browning,,,"Nathan Browning","Parks and Recreation Director, Fayetteville","(931) 433-6059",,,nbrowning@cof-tn.com,"110 Elk Avenue South",Fayetteville,TN,37334,,
Gadsden,Mr.,Dewey,,Gilford,,,"Dewey Gilford","Parks and Recreation, Gadsden","(731) 784-2235",,,,"229 High Street",Gadsden,TN,38337,"PO Box 158",38337
Gallatin,Mr.,David,F.,Brown,,,"David F. Brown","Parks and Recreation Director, Gallatin","(615) 451-5911",,"(615) 451-5908",david.brown@gallatinciviccenter.com,"210 Albert Gallatin Avenue",Gallatin,TN,37066,,
Gatlinburg,Mr.,Laurence,,Evans,,,"Laurence Evans","Parks and Recreation Director, Gatlinburg","(865) 436-4990",,"(865) 430-1390",laurencee@gatlinburgtn.gov,"1230 East Parkway",Gatlinburg,TN,37738,,
Germantown,Ms.,Natalie,,Ruffin,,,"Natalie Ruffin","Parks and Recreation Director, Germantown","(901) 757-7275",,"(901) 757-7385",,"1930 South Germantown Rd",Germantown,TN,38138,,
Goodlettsville,Ms.,Sarah,,Jennings,,,"Sarah Jennings","Parks and Recreation Director, Goodlettsville","(615) 851-2200",,,sjennings@goodlettsville.gov,"105 South Main Street",Goodlettsville,TN,37072,,
Greeneville,Mr.,Butch,,Patterson,,,"Butch Patterson","Parks and Recreation Director, Greeneville","(423) 638-3143",,"(423) 639-7455",bpatterson@greenevilletn.gov,"200 North College Street",Greeneville,TN,37745,,
Halls,Mr.,Phil,,Meeks,,,"Phil Meeks","Parks and Recreation Director, Halls","(731) 836-9653",,,,"208 North Church Street",Halls,TN,38040,,
Harriman,Mr.,Charlie,,Jones,,,"Charlie Jones","Parks and Recreation Director, Harriman","(865) 882-0942",,,,"408 North Roane Street",Harriman,TN,37748,,
Hendersonville,Mr.,Andy,,Gilley,,,"Andy Gilley","Parks and Recreation Director, Hendersonville","(615) 822-3898",,,agilley@hvilletn.org,"101 Maple Drive North",Hendersonville,TN,37075,,
Humboldt,Mr.,Jeff,,Graves,,,"Jeff Graves","Parks and Recreation Director, Humboldt","(734) 784-2511",,,cityofhumboldtparks@gmail.com,"1201 Main Street",Humboldt,TN,38343,,
Jamestown,Mr.,Steve,,Brown,,,"Steve Brown","Street Department Superintendent, Jamestown; Parks and Recreation Superintendent, Jamestown","(931) 879-8815",,"(931) 879-3543",,"314 East Central Avenue, PO Box 670",Jamestown,TN,38556,,
Jasper,Mr.,Justin,,Baker,,,"Justin Baker","Parks and Recreation Director, Jasper","(423) 942-5979",,,,"4460 Main Street",Jasper,TN,37347,,
"Jefferson City",Mr.,Kevin,,Bolden,,,"Kevin Bolden","Parks and Recreation Director, Jefferson City","(865) 475-2924",,,kbolden@jeffcitytn.com,"112 City Center Drive, P.O. Box 530","Jefferson City",TN,37760,,
Jellico,Ms.,Suzette,,Davenport,,,"Suzette Davenport","Parks and Recreation Director, Jellico","(423) 784-6351",,,,"410 South Main Street",Jellico,TN,37762,,
"Johnson City",Ms.,April,,Norris,,,"April Norris","Parks and Recreation Director, Johnson City","(423) 283-5809",,,anorris@johnsoncitytn.org,"601 East Main Street, P.O. Box 2150","Johnson City",TN,37605-2150,,
Jonesborough,,VACANT,,VACANT,,,VACANT,"Parks and Recreation Director, Jonesborough",,,,,"123 Boone Street",Jonesborough,TN,37659-1390,,
Kingsport,Ms.,Kitty,C.,Frazier,,,"Kitty C. Frazier","Parks and Recreation Manager, Kingsport","(423) 229-9457",,"(423) 246-1920",kittyfrazier@kingsporttn.gov,"415 Broad Street",Kingsport,TN,37660,,
Kingston,Mr.,J.R.,,Best,,,"J.R. Best","Parks and Recreation Director, Kingston","(865) 376-9476",,,JR.Best@kingstontn.gov,"201 Patton Ferry Road",Kingston,TN,37763,,
"Kingston Springs",Ms.,Brandy,,Miniat,,,"Brandy Miniat","Park Director, Kingston Springs","(615) 952-9885",,,bminiat@kingstonsprings-tn.gov,"396 Spring Street","Kingston Springs",TN,37082,"P.O. Box 256",37082
Knoxville,Ms.,Sheryl,,Ely,,,"Sheryl Ely","Parks and Recreation Director, Knoxville","(865) 215-4311",,"(865) 215-2408",sely@knoxvilletn.gov,"City County Building, 400 Main Street",Knoxville,TN,37902,,
LaFollette,Mr.,Johnny,,Byrge,,,"Johnny Byrge","Parks and Recreation Director, LaFollette","(423) 562-2241",,,,"207 South Tennessee Avenue",LaFollette,TN,37766,,
Lakeland,Mr.,Andrew,,Fisher,,,"Andrew Fisher","Parks and Recreation Director, Lakeland","(901) 867-2717",402,,,"10001 Highway 70",Lakeland,TN,38002,,
"La Vergne",Mr.,David,,McGowen,,,"David McGowen","Parks and Recreation Director, La Vergne","(615) 793-7224",,"(615) 793-9213",dmcgowen@lavergnetn.gov,"5093 Murfreesboro Road","La Vergne",TN,37086,,
Lawrenceburg,Ms.,Pam,,Hyde,,,"Pam Hyde","Parks and Recreation Director, Lawrenceburg","(931) 762-4231",,,,"25 Public Square",Lawrenceburg,TN,38464,,
Lebanon,Mr.,William,,Porter,,,"William Porter","Parks and Recreation Director, Lebanon","(615) 449-0303",,,wporter@lebanontn.org,"200 North Castle Heights Avenue",Lebanon,TN,37087,,
"Lenoir City",Mr.,Zack,,Cusick,,,"Zack Cusick","Parks and Recreation Director, Lenoir City","(865) 986-1223",2,,Zcusick@lenoircitytn.gov,"530 Highway 321 N.","Lenoir City",TN,37771,,
Lewisburg,Mr.,Cary,,Whitesell,,,"Cary Whitesell","Parks and Recreation Director, Lewisburg","(931) 359-2482",,"(931) 359-9299",,"131 East Church Street",Lewisburg,TN,37091,,
"Lookout Mountain",Mr.,Scott,,Shell,,,"Scott Shell","Parks & Playgrounds Director, Lookout Mountain","(423) 821-1226",,,sshell@lookoutmtn.us,"710 Scenic Highway, PO Box 111","Lookout Mountain",TN,37350,,
Loretto,Mr.,Mitch,,Webb,,,"Mitch Webb","Parks and Recreation Director, Loretto","(931) 853-6797",,,mwebb@cityoflorettotn.com,"415 N Military Street",Loretto,TN,38469,,
Madisonville,Ms.,Kim,,Harrill,,,"Kim Harrill","Parks and Recreation, Madisonville","(423) 442-9416",,,kimharrill@madisonvilletn.net,"400 College St. North",Madisonville,TN,37354,,
Manchester,Mr.,A.J.,,Fox,,,"A.J. Fox","Parks and Recreation Director, Manchester","(931) 728-0273",,"(931) 728-3706",ajfox@cityofmanchestertn.com,"557 N. Woodland St.",Manchester,TN,37355,,
Martin,Mr.,Brian,,Moore,,,"Brian Moore","Parks and Recreation Director, Martin","(731) 587-6784",,"(731) 587-9273",bmoore@cityofmartin.net,"109 University Street",Martin,TN,38237,,
Maryville,Mr.,Joe,,Huff,,,"Joe Huff","Parks and Recreation Director, Maryville; Parks and Recreation Director, Alcoa","(865) 983-9244",,"(865) 983-8831",,"400 West Broadway",Maryville,TN,37801-4710,,
McMinnville,Mr.,Justin,,Scott,,,"Justin Scott","Parks and Recreation Director, McMinnville","(931) 473-1212",,"(931) 473-1214",jscott@mcminnvilletn.gov,"500 Garfield St.,P.O. Box 7088",McMinnville,TN,37110,,
Medina,Mr.,Mike,,Hutcherson,,,"Mike Hutcherson","Parks and Recreation Director, Medina","(731) 783-1403",,,mhutcherson@cityofmedinatn.org,"201 Hwy 45E North, PO Box 420",Medina,TN,38355,,
Memphis,Mr.,Carey,,Walker,,,"Carey ""Nick"" Walker","Parks and Neighborhood Director, Memphis","(901) 636-4200",,,nick.walker@memphistn.gov,"2599 Avery Avenue",Memphis,TN,38112,,
Milan,Mr.,Roger,,Smith,,,"Roger Smith","Public Works Director, Milan; Parks and Recreation Director, Milan","(731) 686-1611",,"(731) 686-8816",rogersmith@cityofmilantn.com,"Milan Department of Public Works,2041 College St.",Milan,TN,38358,,
Morristown,Mr.,Craig,,Price,,,"Craig Price","Parks and Recreation Director, Morristown","(423) 586-0260",,"(423) 318-1544",cprice@mymorristown.com,"100 West First North Street, P.O. Box 1499",Morristown,TN,37816-1499,,
"Mount Pleasant",Ms.,Alyshia,,Busby,,,"Alyshia Busby","Parks and Recreation Director, Mount Pleasant","(931) 379-7717",,,abusby@mtpleasant-tn.gov,"100 Public Square","Mount Pleasant",TN,38474,"P.O. Box 426",38474
Munford,Mr.,Griff,,Fisher,,,"Griff Fisher","Parks and Recreation Director, Munford","(901) 837-5940",,,gfisher@munford.com,"1397 Munford Avenue",Munford,TN,38058,,
Murfreesboro,Mr.,Nate,,Williams,,,"Nate Williams","Parks and Recreation Director, Murfreesboro","(615) 890-5333",,,nwilliams@murfreesborotn.gov,"111 West Vine Street",Murfreesboro,TN,37130,"PO Box 1139",37133-1139
Nashville,Ms.,Monique,,Odom,,,"Monique Odom","Parks and Recreation Director, Nashville","(615) 862-8400",,,monique.odom@nashville.gov,"1 Public Sq","Nashville (Davidson County)",TN,37201,,
Newport,Mr.,Tim,,Dockery,,,"Tim Dockery","Parks and Recreation Director, Newport","(423) 623-7304",,,tdoc@newporttn.org,"P.O. Box 370",Newport,TN,37822-0370,,
"Oak Ridge",Mr.,Jonathan,W.,Hetrick,,,"Jonathan W. Hetrick","Parks and Recreation Director, Oak Ridge","(865) 425-3450",,"(865) 425-3418",jhetrick@oakridgetn.gov,"200 So. Tulane Ave.","Oak Ridge",TN,37830,"PO Box 1",37831-0001
"Oliver Springs",Mr.,Eddie,,Kelley,,,"Eddie Kelley","Parks and Recreation Director, Oliver Springs","(865) 435-7722",,,,"717 Main Street","Oliver Springs",TN,37841,,
Paris,Mr.,Tony,,Lawrence,,,"Tony Lawrence","Parks and Recreation Director, Paris","(731) 644-2517",,,tony.lawrence@parisssd.org,"100 N Caldwell,P.O. Box 970",Paris,TN,38242,,
Pegram,Mr.,Danny,,Crutcher,,,"Danny Crutcher","Public Works Supervisor, Pegram; Parks Dept. Supervisor, Pegram","(615) 533-2637",,"(615) 646-6869",publicworks@pegram.net,"308 Hwy 70,P.O. Box 249",Pegram,TN,37143,,
"Pigeon Forge",Mr.,Lanny,,Goodwin,,,"Lanny Goodwin","Parks and Recreation Director, Pigeon Forge","(865) 429-7373",,"(865) 429-7374",lgoodwin@cityofpigeonforgetn.gov,"P.O. Box 605","Pigeon Forge",TN,37868,,
Portland,Mr.,Jamie,,White,,,"Jamie White","Parks and Recreation Director, Portland","(615) 325-6776",183,,jwhite@cityofportlandtn.gov,"Richland Park Office, 301 Portland Blvd",Portland,TN,37148,,
Pulaski,Mr.,Lane,,Rose,,,"Lane Rose","Park Director, Pulaski","(931) 363-4666",,,,"203 South First Street, P.O. Box 633",Pulaski,TN,38478-0633,,
Ripley,Mr.,Randy,,Danley,,,"Randy Danley","Parks and Recreation Director, Ripley","(731) 635-4645",,,rdanley@cityofripleytn.com,"200 Mary Robert Drive",Ripley,TN,38063,,
Rockwood,,,,,,,VACANT,"Parks and Recreation Director, Rockwood","(865) 354-0611",,,parksandrecreation@cityofrockwood.com,"110 North Chamberlain Avenue",Rockwood,TN,37854,,
Rogersville,Mr.,Matthew,,Elkins,,,"Matthew Elkins","Parks and Recreation Director, Rogersville","(423) 272-2545",,,MatthewE@RogersvilleTN.gov,"106 East Kyle Street, P.O. Box 788",Rogersville,TN,37857,,
Rutherford,Mr.,David,,Tidwell,,,"David Tidwell","Parks and Recreation Director, Rutherford","(731) 665-7166",,"(731) 665-6897",,"202 East Main Street, PO Box 487",Rutherford,TN,38369,,
Savannah,Mr.,Corey,,Jennings,,,"Corey Jennings","Parks and Recreation Director, Savannah","(731) 925-5595",,"(731) 926-1130",cjennings@cityofsavannah.org,"140 Main Street",Savannah,TN,38372,,
Selmer,Ms.,Sybil,,Dancer,,,"Sybil Dancer","Parks and Recreation Director, Selmer","(731) 645-3866",,,selmercommunity@selmercityhall.com,"144 North Second Street",Selmer,TN,38375,,
Sevierville,Mr.,Bob,,Parker,,,"Bob Parker","Parks and Recreation Director, Sevierville","(865) 868-1896",,"(865) 428-2560",bparker@seviervilletn.org,"120 Gary Wade Blvd.",Sevierville,TN,37862,"PO Box 5500",37864-5500
Sharon,Mr.,Bill,,Bostwick,,,"Bill Bostwick","Parks and Recreation Director, Sharon","(731) 456-2122",,,,"5320 Hwy 45 S, PO Box 235",Sharon,TN,38255,,
Shelbyville,Mr.,Mike,,Alsup,,,"Mike Alsup","Parks and Recreation Director, Shelbyville","(931) 684-9780",,"(931) 684-0190",mike.alsup@shelbyvilletn.org,"201 N. Spring Street",Shelbyville,TN,37160,,
Smyrna,Mr.,Mike,,Moss,,,"Mike Moss","Parks and Recreation Director, Smyrna","(615) 459-9773",,"(615) 459-9727",mike.moss@townofsmyrna.org,"100 Sam Ridley Blvd",Smyrna,TN,37167,,
"Spring Hill",Miss,Kayce,,Williams,,,"Kayce Williams","Parks and Recreation Director, Spring Hill","(931) 486-0027",420,,kwilliams@springhilltn.org,"199 Town Center Parkway","Spring Hill",TN,37174,,
Springfield,Mr.,Terry,,Martin,,,"Terry Martin","Parks and Recreation Director, Springfield","(615) 382-1655",,"(615) 382-2229",Terry.Martin@springfieldtn.gov,"405 North Main Street, P.O. Box 788",Springfield,TN,37172,,
"Three Way",Mr.,Jace,,Seymore,,,"Jace Seymore","Parks and Recreation Director, Three Way; Street Director, Three Way","(731) 784-7782",,,,"190 Three Way Lane","Three Way",TN,38343,,
Tiptonville,Mr.,Nik,,Butler,,,"Nik Butler","Parks and Recreation Director, Tiptonville","(731) 253-3585",,,,"130 South Court Street",Tiptonville,TN,38079,,
Trezevant,Mrs.,"Mary Jo",,Hall,,,"Mary Jo Hall","Street Supervisor, Trezevant; Parks and Recreation, Trezevant","(731) 415-7582",,"(731) 330-1452",,"P.O. Box 100",Trezevant,TN,38258,,
Tullahoma,Mr.,J.P.,,Kraft,,,"J.P. Kraft","Parks and Recreation Director, Tullahoma","(931) 455-1121",,,jkraft@tullahomatn.gov,"201 West Grundy Street, PO Box 807",Tullahoma,TN,37388,,
"Union City",Mr.,Robin,,Francis,,,"Robin Francis","Parks and Recreation Director, Union City","(731) 885-0354",,,,"408 South Depot Street","Union City",TN,38261,"P.O. Box 9",38261
Watertown,Mr.,Robert,,Morgan,,,"Robert Morgan","Parks and Recreation Director, Watertown; Street Superintendent, Watertown","(615) 237-3326",,,,"8630 Sparta Pike",Watertown,TN,37184,,
Waynesboro,Mr.,Derrick,,Gobbell,,,"Derrick Gobbell","Parks and Recreation Director, Waynesboro","(931) 722-5458",,,,"122 Public Square East, P.O. Box 471",Waynesboro,TN,38485,,
"White House",Mr.,Keith,,Whittaker,,,"Keith Whittaker","Parks and Recreation Director, White House","(615) 672-4350",2114,,,"105-D College Street","White House",TN,37188,,