Organization,Salutation,First,Middle,Last,Generational,Credentials,"Preferred Name",Title,Phone,"Phone Extension",Fax,Email,Address,City,State,Zip,"Billing Address","Billing Zip"
Alcoa,Ms.,Brittany,L.,Spence,,,"Brittany L. Spence","Finance Director, Alcoa","(865) 380-4748",,"(865) 380-4785",bspence@cityofalcoa-tn.gov,"223 Associates Blvd.",Alcoa,TN,37701-1943,,
Alexandria,Ms.,Liz,,Tetlow,,,"Liz Tetlow","CMFO, Alexandria","(615) 529-2171",,,cityrecorder@dtccom.net,"102 High Street, P.O. Box 277",Alexandria,TN,37012,,
"Ashland City",Ms.,Gayle,,Bowman,,,"Gayle Bowman","Financial Director, Ashland City","(615) 792-4211",5222,,GBowman@ashlandcitytn.gov,"233 Tennessee Waltz Parkway, Suite 103","Ashland City",TN,37015,"PO Box 36",37015
Athens,Mr.,Michael,,Keith,,,"Michael ""Mike"" Keith","Finance Director, Athens","(423) 744-2712",,"(423) 744-8866",mkeith@athenstn.gov,"815 North Jackson Street",Athens,TN,37303,,
Bartlett,Mr.,Dick,,Phebus,,,"Dick Phebus","Finance Director, Bartlett","(901) 385-1060",,"(901) 384-8061",dphebus@cityofbartlett.org,"6400 Stage Road",Bartlett,TN,38134-3739,,
"Belle Meade",Ms.,Leigh,,Mills,,,"Leigh Mills","Finance & Human Resources Director, Belle Meade","(615) 297-6041",,,lmills@citybellemeade.org,"4705 Harding Pike","Belle Meade",TN,37205,,
"Bluff City",Ms.,Sharon,,Greene,,,"Sharon Greene","City Recorder, Bluff City; Finance Director, Bluff City","(423) 538-7144",,,sgreene@bluffcitytn.gov,"4391 Bluff City Highway, P.O. Box 70","Bluff City",TN,37618,,
Bolivar,Ms.,Lisa,,Dellinger,,,"Lisa Dellinger","Human Resources Manager, Bolivar; Finance Director, Bolivar","(731) 658-2020",104,,lisa.dellinger.cityofbolivar@gmail.com,"City Hall, 211 North Washington Street",Bolivar,TN,38008,,
Brentwood,Ms.,Karen,W.,Harper,,,"Karen W. Harper","Finance Director, Brentwood","(615) 371-0060",,,karen.harper@brentwoodtn.gov,"5211 Maryland Way, P.O. Box 788",Brentwood,TN,37024-0788,,
Bristol,Ms.,Hollie,,Verran,,,"Hollie Verran","Finance Director, Bristol","(423) 989-5500",,,hverran@bristoltn.org,"801 Anderson St., PO Box 1189",Bristol,TN,37621-1189,"PO Box 1189",37621-1189
Bruceton,Ms.,Annie,M.,Hand,,,"Annie M. Hand","City Recorder, Bruceton; Finance Director, Bruceton","(731) 586-2401",,,cityrecorder@townofbrucetontn.org,"209 Cheatham Street",Bruceton,TN,38317,,
Carthage,Mr.,Scott,,Ezell,,,"Scott Ezell","Chief Financial Officer, Carthage","(615) 735-1881",213,,sezell@townofcarthagetn.com,"314 Spring Street, P.O. Box 259",Carthage,TN,37030,,
Clarksville,Mr.,Christen,,Wilcox,,,"Christen Wilcox","Interim Finance Director, Clarksville","(931) 645-7437",,"(931) 553-2471",christen.wilcox@cityofclarksville.com,"1 Public Square, PO Box 928",Clarksville,TN,37040,,
Clarksville,Ms.,Laurie,,Matta,,,"Laurie Matta","Chief Financial Officer, Clarksville","(931) 645-7437",,,laurie.matta@cityofclarksville.com,"1 Public Square, PO Box 928",Clarksville,TN,37040,,
Cleveland,Mr.,Shawn,,McKay,,,"Shawn McKay","Assistant City Manager/CFO, Cleveland; City Clerk, Cleveland; Finance Director, Cleveland; City Recorder, Cleveland","(423) 472-4551",,"(423) 559-3302",smckay@clevelandtn.gov,"190 Church Street NE, P.O. Box 1519",Cleveland,TN,37364-1519,,
Clifton,Ms.,Kiersten,,Rainey,,,"Kiersten Rainey","Finance Director, Clifton","(931) 676-3370",,,raineyk@cityofclifton.com,"142 Main Street, P.O. Box 192",Clifton,TN,38425,,
Clinton,Mr.,Chris,,Phillips,,,"Chris Phillips","Finance Director, Clinton","(865) 259-1105",,,cphillips@clintontn.net,"100 Bowling Street",Clinton,TN,37716,,
Collegedale,Ms.,Michelle,,Toro,,,"Michelle Toro","Assistant City Manager, Collegedale; Chief Financial Officer, Collegedale","(423) 468-1863",,,mtoro@collegedaletn.gov,"4910 Swinyar Drive, P.O. Box 1880",Collegedale,TN,37315-1880,,
Collierville,Ms.,Valesa,,Wells,,,"Valesa Wells","Finance Director, Collierville","(901) 457-2200",,,vwells@colliervilletn.gov,"500 Poplar View Parkway",Collierville,TN,38017-3440,,
Columbia,Mr.,Thad,,Jablonski,,,"Thad Jablonski","Assistant City Manager/CFO/City Recorder, Columbia","(931) 560-1580",,,tjablonski@columbiatn.com,"700 North Garden Street",Columbia,TN,38401,,
Cookeville,Mrs.,Brenda,,Imel,,,"Brenda Imel","Finance Director, Cookeville","(931) 520-5211",,,brenda@cookeville-tn.gov,"45 East Broad Street, PO Box 998",Cookeville,TN,38501-0998,,
Coopertown,Mrs.,Emily,,McKellar,,,"Emily McKellar","City Recorder, Coopertown; CMFO, Coopertown","(615) 382-4470",214,,recorder@coopertowntn.org,"2525 Burgess Gower Rd",Coopertown,TN,37172,,
"Crab Orchard",Ms.,Gerri,,Norris,,,"Gerri Norris","Finance Director, Crab Orchard; City Recorder, Crab Orchard","(931) 484-2815",,,theorchard@frontiernet.net,"338 Hebbertsburg Road, P.O. Box 215","Crab Orchard",TN,37723,,
Crossville,Mr.,Fred,,Houston,,,"Fred Houston","Finance Director, Crossville","(931) 484-5113",,,fred.houston@crossvilletn.gov,"392 N Main Street",Crossville,TN,38555,,
Crump,Mrs.,Pamela,R.,Hardy,,,"Pamela ""Pam"" R. Hardy","City Recorder, Crump; City Administrator, Crump; Chief Financial Officer, Crump; City Court Clerk, Crump","(731) 632-4224",,"(731) 632-0644",Phardy@crumpcityhall.org,"55 Hardy Road",Adamsville,TN,38310,,
Dandridge,Mrs.,Kendall,,Moore,,,"Kendall Moore","Finance Director, Dandridge","(865) 397-7420",,,kmoore@dandridgetn.gov,"131 East Main Street, P.O. Box 249",Dandridge,TN,37725,,
Dresden,Ms.,Carla,,Edwards,,,"Carla Edwards","Finance Director, Dresden","(731) 364-2270",,,,"589 Evergreen Street",Dresden,TN,38225,,
"East Ridge",Ms.,Diane,,Qualls,,,"Diane Qualls","Finance Director, East Ridge","(423) 867-7711",,,dqualls@eastridgetn.gov,"1517 Tombras Avenue","East Ridge",TN,37412,,
Elizabethton,Mr.,Preston,T.,Cobb,,,"Preston T. Cobb","Finance Director, Elizabethton; City Clerk, Elizabethton","(423) 547-6231",,,pcobb@cityofelizabethton.org,"136  S. Sycamore Street",Elizabethton,TN,37643,,
Etowah,Ms.,Alison,,Bull,,,"Alison Bull","Finance Director, Etowah","(423) 263-2202",,,finance@cityofetowahtn.com,"Etowah City Hall, 701 Tennessee Ave.",Etowah,TN,37331-1345,,
Fairview,Mr.,Ben,,Knox,,,"Ben Knox","Finance Director, Fairview","(615) 387-6085",,,bknox@fairview-tn.org,"7100 City Center Way, P.O. Box 69",Fairview,TN,37062,,
Fayetteville,Ms.,Loretta,,Garner,,,"Loretta Garner","Finance Director, Fayetteville","(931) 433-6154",,,lgarner@cof-tn.com,"110 Elk Avenue South",Fayetteville,TN,37334,,
Franklin,Ms.,Kristine,,Brock,,,"Kristine Brock","Assistant City Administrator, Franklin; Chief Financial Officer, Franklin","(615) 791-1457",,,kristine.brock@franklintn.gov,"109 Third AV South",Franklin,TN,37064,,
Gallatin,Ms.,Rachel,,Nichols,,,"Rachel Nichols","Finance Director, Gallatin","(615) 451-5963",,"(615) 451-5960",rachel.nichols@gallatintn.gov,"132 West Main Street",Gallatin,TN,37066,,
Gatlinburg,Mr.,Robert,,Holt,,,"Robert Holt","Finance Director, Gatlinburg","(865) 436-1403",,,roberth@gatlinburgtn.gov,"1230 East Parkway",Gatlinburg,TN,37738,,
Germantown,Ms.,Adrienne,,Royals,,,"Adrienne Royals","Budget & Financial Services Director, Germantown","(901) 751-5641",,,aroyals@germantown-tn.gov,"1930 South Germantown Rd",Germantown,TN,38138,,
Goodlettsville,Ms.,Julie,J.,High,,,"Julie J. High","Finance Director, Goodlettsville; Assistant City Manager, Goodlettsville","(615) 851-2201",,,jhigh@goodlettsville.gov,"105 South Main Street",Goodlettsville,TN,37072,,
Greenbrier,Ms.,April,,Sanford,,,"April Sanford","City Clerk, Greenbrier; CMFO, Greenbrier","(615) 643-4531",,,asanford@greenbriertn.org,"2414 Hwy 41 S",Greenbrier,TN,37073,,
Greeneville,Ms.,Lora,,Young,,,"Lora Young","Finance Director, Greeneville; City Recorder, Greeneville","(423) 639-7105",,,lyoung@greenevilletn.gov,"200 North College Street",Greeneville,TN,37745,,
Harrogate,Ms.,Debra,,England,,,"Debra England","City Recorder, Harrogate; CMFO, Harrogate","(423) 869-0211",,,debengland.cityofharrogate@gmail.com,"138 Harrogate Crossing, P.O. Box 979",Harrogate,TN,37752,,
Hartsville,Ms.,Amy,,Thomas,,,"Amy Thomas","Administrative Assistant, Hartsville; CCFO, Hartsville","(615) 374-2461",,,amy.thomas@trousedalecountytn.gov,"328 Broadway, Room 6","Hartsville (Trousdale County)",TN,37074,,
Hendersonville,Mr.,Robert,,Manning,,,"Robert Manning","Finance Director, Hendersonville","(615) 264-5317",,"(615) 590-4641",,"101 Maple Drive North",Hendersonville,TN,37075,,
"Hickory Valley",Ms.,Loretta,,Bell,,,"Loretta Bell","City Recorder, Hickory Valley; CMFO, Hickory Valley","(731) 764-2947",,,loretta.bellcmfo@gmail.com,"7115 Hwy 18 S  P.O. Box 39","Hickory Valley",TN,38042,"P.O. Box 39",38042
Hohenwald,Mr.,Kyle,,Hamm,,,"Kyle Hamm","Finance Director, Hohenwald; CMFO, Hohenwald; Chief Financial Officer, Hohenwald","(931) 796-2231",,,khamm@hohenwald.com,"118 West Linden Avenue",Hohenwald,TN,38462,,
Jackson,Mr.,Bobby,,Arnold,,,"Bobby Arnold","City Recorder, Jackson; Finance Director, Jackson","(731) 425-8278",,"(731) 425-8209",barnold@jacksontn.gov,"121 E. Main Street, Suite 301",Jackson,TN,38301,,
"Johnson City",Ms.,Stephanie,,Laos,,,"Stephanie Laos","City Recorder, Johnson City; Finance Director, Johnson City","(423) 434-6033",,,slaos@johnsoncitytn.org,"601 East Main Street, P.O. Box 2150","Johnson City",TN,37605-2150,,
Kimball,Ms.,Sharon,,Case,,,"Sharon Case","Town Clerk, Kimball; City Court Clerk, Kimball; CMFO, Kimball","(423) 837-7040",,,scase@townofkimball.com,"675 Main Street",Kimball,TN,37347,,
Kimball,Mrs.,Tonia,,May,,,"Tonia May","City Recorder, Kimball; Human Resources Director, Kimball; CMFO, Kimball","(423) 837-7040",,,tmay@townofkimball.com,"675 Main Street",Kimball,TN,37347,,
Kingsport,Ms.,Lisa,,Winkle,,,"Lisa Winkle","City Recorder, Kingsport; Finance Director, Kingsport","(423) 229-9431",,,lisawinkle@kingsporttn.gov,"415 Broad Street",Kingsport,TN,37660,,
Kingston,Ms.,Michelle,,Kelley,,,"Michelle Kelley","Finance Director, Kingston","(865) 376-6584",1109,"(865) 376-2325",Michelle.Kelley@kingstontn.gov,"900 Waterford Place",Kingston,TN,37763,,
"Kingston Springs",Ms.,Kellie,,Reed,,,"Kellie Reed","Financial Director, Kingston Springs; City Court Clerk, Kingston Springs","(615) 952-2110",7,,kreed@kingstonsprings-tn.gov,"396 Spring Street","Kingston Springs",TN,37082,"P.O. Box 256",37082
Knoxville,Mr.,Boyce,,Evans,,,"Boyce Evans","Chief Financial Officer, Knoxville","(865) 215-2062",,"(865) 215-2277",bevans@knoxvilletn.gov,"City County Building, 400 Main Street",Knoxville,TN,37902,,
LaFollette,Mr.,Terry,,Sweat,,,"Terry Sweat","Finance Director, LaFollette","(423) 562-4961",,,tsweat@lafollettetn.net,"207 South Tennessee Avenue",LaFollette,TN,37766,,
Lakeland,Ms.,Andrea,,Perkins,,,"Andrea Perkins","Finance Director, Lakeland","(901) 867-2727",,,,"10001 Highway 70",Lakeland,TN,38002,,
"La Vergne",Ms.,Tonya,,Williams,,,"Tonya Williams","Finance Director, La Vergne","(615) 287-8632",,,twilliams@lavergnetn.gov,"5093 Murfreesboro Road","La Vergne",TN,37086,,
Lebanon,Mr.,Stuart,,Lawson,,,"Stuart Lawson","Finance Commissioner, Lebanon","(615) 443-2805",2207,,stuart.lawson@lebanontn.org,"200 North Castle Heights Avenue",Lebanon,TN,37087,,
"Lenoir City",Ms.,Maggie,,Hunt,,,"Maggie Hunt","Finance Director, Lenoir City","(865) 986-2227",,,mhunt@lenoircitytn.gov,"530 Highway 321 N.","Lenoir City",TN,37771,,
Lexington,Mr.,Cody,C.,Wood,,,"Cody C. Wood","City Recorder, Lexington; Chief Financial Officer, Lexington","(731) 968-6657",,,cody.wood@lexingtontn.gov,"33 1st Street, PO Box 1699",Lexington,TN,38351,"P.O. Box 1699",38351
Livingston,Ms.,Phyllis,,Looper,,,"Phyllis Looper","Finance Office Manager, Livingston; City Clerk, Livingston","(931) 823-1269",,,plooper@cityoflivingston.net,"301 McHenry Circle",Livingston,TN,38570,,
Manchester,Ms.,Lisa,,Myers,,,"Lisa Myers","Chief Financial Officer, Manchester","(931) 728-4652",1300,"(931) 728-8244",lmyers@cityofmanchestertn.com,"200 West Fort Street",Manchester,TN,37355,,
Maryville,Ms.,Sherri,,Phillips,,,"Sherri Phillips","Finance Director, Maryville","(865) 273-3452",,,sphillips@maryville-tn.gov,"400 West Broadway",Maryville,TN,37801-4710,,
McMinnville,Ms.,Samantha,,Moore,,,"Samantha Moore","Finance Director, McMinnville; Treasurer, McMinnville","(931) 473-1200",,,smoore@mcminnvilletn.gov,"101 East Main Street, P.O. Box 7088",McMinnville,TN,37110,,
Memphis,Ms.,Dywuana,,Morris,,,"Dywuana Morris","Comptroller, Memphis","(901) 636-6682",,"(901) 576-6191",dywuana.morris@memphistn.gov,"125 N. Main Street",Memphis,TN,38103,,
Memphis,Ms.,Shirley,,Ford,,,"Shirley Ford","Chief Financial Officer, Memphis","(901) 636-6657",,,shirley.ford@memphistn.gov,"125 N. Main Street",Memphis,TN,38103,,
Middleton,Mr.,Jimmy,,Simpson,Jr.,,"Jimmy Simpson, Jr.","City Administrator, Middleton; CMFO, Middleton","(731) 376-8409",,,j.simpson@middletontn.com,"300 South Main",Middleton,TN,38052,"PO Box 40",38052
Millington,Mr.,Randy,,Hendon,,,"Randy Hendon","Finance Director, Millington","(901) 873-5701",,,r.hendon@millingtontn.gov,"7930 Nelson Road",Millington,TN,38053-2044,,
"Mount Carmel",Ms.,Emily,,Wood,,,"Emily Wood","Town Manager, Mount Carmel; CMFO, Mount Carmel","(423) 357-7311",,,Emily.Wood@MountCarmelTn.gov,"100 East Main Street","Mount Carmel",TN,37645-1421,"PO Box 1421",37645-1421
"Mount Pleasant",Ms.,Shiphrah,,Cox,,,"Shiphrah Cox","City Recorder, Mount Pleasant; Finance Director, Mount Pleasant","(931) 379-7717",,,scox@mtpleasant-tn.gov,"100 Public Square","Mount Pleasant",TN,38474,"P.O. Box 426",38474
"Mt. Juliet",Ms.,Dana,,Hire,,,"Dana Hire","Finance Director, Mt. Juliet","(615) 754-2552",255,,dhire@mtjuliet-tn.gov,"PO Box 256","Mt. Juliet",TN,37121,,
Murfreesboro,Ms.,Jennifer,,Brown,,,"Jennifer Brown","Finance Director, Murfreesboro; City Recorder, Murfreesboro; Treasurer, Murfreesboro","(615) 893-5210",,"(615) 848-3247",jbrown@murfreesborotn.gov,"111 West Vine Street",Murfreesboro,TN,37130,"PO Box 1139",37133-1139
Nashville,Ms.,Kelly,,Flannery,,,"Kelly Flannery","Finance Director, Nashville","(615) 862-6151",,"(615) 862-6156",kelly.flannery@nashville.gov,"1 Public Sq","Nashville (Davidson County)",TN,37201,,
"New Johnsonville",Ms.,Brandy,,Vann,,,"Brandy Vann","City Recorder, New Johnsonville; CMFO, New Johnsonville","(931) 535-2715",,,cityofnj@tds.net,"323 Long Street","New Johnsonville",TN,37134,,
Newport,Ms.,Christina,,Matthews,,,"Christina Matthews","Finance Director, Newport; City Recorder, Newport","(423) 623-7323",,,tinam@newporttn.org,"P.O. Box 370",Newport,TN,37822-0370,,
Nolensville,Ms.,Christina,,Merle,,,"Christina Merle","Finance Director, Nolensville","(615) 776-3235",,,cmerle@nolensvilletn.gov,"7218 Nolensville Road",Nolensville,TN,37135,,
"Oak Hill",Ms.,Melissa,,McGee,,,"Melissa McGee","CMFO, Oak Hill","(615) 371-8291",,,,"5548 Franklin Pike, Suite 101","Oak Hill",TN,37220,,
"Oak Ridge",Ms.,Janice,E.,McGinnis,,,"Janice E. McGinnis","Finance Director, Oak Ridge","(865) 425-3617",,"(865) 425-3425",jmcginnis@oakridgetn.gov,"200 So. Tulane Ave.","Oak Ridge",TN,37830,"PO Box 1",37831-0001
Oakdale,Ms.,Elecia,,Miller,,,"Elecia Miller","Finance Director, Oakdale","(423) 369-4400",,,oakdalectyhl@highland.net,"204 Queen Street, P.O. Box 116",Oakdale,TN,37829,,
Oakland,Ms.,Laura,,Hodges,,,"Laura Hodges","Finance Director, Oakland","(901) 465-3108",,,lhodges@oaklandtn.gov,"170 Doss Circle; PO Box 56",Oakland,TN,38060,,
"Oliver Springs",Ms.,Ramona,,Walker,,,"Ramona Walker","Finance Director, Oliver Springs; City Court Clerk, Oliver Springs","(865) 435-7722",3,"(865) 435-7705",rlwalker701@comcast.net,"717 Main Street","Oliver Springs",TN,37841,,
Paris,Ms.,Tammie,,Hopper,,,"Tammie Hopper","City Recorder, Paris; Finance Director, Paris","(731) 641-1406",,,thopper@cityofparistn.gov,"100 N. Caldwell",Paris,TN,38242,"P.O. Box 970",38242
Parsons,Ms.,Colleen,,Lawlor,,,"Colleen Lawlor","City Recorder, Parsons; CMFO, Parsons; City Court Clerk, Parsons","(731) 847-6358",,,recorder@cityofparsons.com,"535 Tennesee Ave South",Parsons,TN,38363,"PO Box 128",38363
"Pigeon Forge",Mr.,Dennis,,Clabo,,,"Dennis Clabo","Finance Director, Pigeon Forge","(865) 453-9061",,,dclabo@cityofpigeonforgetn.gov,"3221 Rena Street, P.O. Box 1350","Pigeon Forge",TN,37868-1350,,
Piperton,Ms.,Maria,,George,,,"Maria George","Finance Director, Piperton","(901) 853-4830",2,,mgeorge@pipertontn.com,"3725 Hwy 196 S Suite B",Piperton,TN,38017,,
Portland,Ms.,Rachel,,Slusser,,,"Rachel Slusser","Finance Director, Portland","(615) 325-6776",231,"(615) 325-7075",,"100 South Russell Street",Portland,TN,37148,,
Pulaski,Mr.,Terry,W.,Harrison,,,"Terry W. Harrison","City Recorder, Pulaski; City Administrator, Pulaski; Finance Director, Pulaski; Building and Zoning Official, Pulaski","(931) 363-2516",,,recorder@pulaski-tn.com,"203 South First Street, P.O. Box 633",Pulaski,TN,38478-0633,,
"Red Bank",,VACANT,,VACANT,,,VACANT,"Finance Director, Red Bank",,,,,"3105 Dayton Blvd","Red Bank",TN,37415,"3105 Dayton Blvd.",37415
Ridgeside,Mr.,Brant,,Mason,,,"Brant Mason","Finance Director, Ridgeside","(423) 698-4326",,,,"P.O. Box 3265",Ridgeside,TN,37404,,
Rockwood,Ms.,Belinda,,Kretzer,,,"Belinda Kretzer","Finance Director, Rockwood","(865) 354-0611",820,,belinda.kretzer@cityofrockwood.com,"110 North Chamberlain Avenue",Rockwood,TN,37854,,
Rogersville,Ms.,Linda,,Winegar,,,"Linda Winegar","Finance Director, Rogersville","(423) 272-7497",,,lindaw@rogersvilletn.gov,"106 East Kyle Street, P.O. Box 788",Rogersville,TN,37857,,
Selmer,Ms.,ANJI,,DEATON,,,"Anji Deaton","CMFO, Selmer","(731) 645-7928",,"(731) 645-8180",aadsud@selmerutility.com,"144 North Second Street",Selmer,TN,38375,,
Sevierville,Ms.,Lynn,,McClurg,,,"Lynn McClurg","City Recorder, Sevierville; Finance Director, Sevierville","(865) 453-5504",,,lmcclurg@seviervilletn.org,"120 Gary Wade Blvd.",Sevierville,TN,37862,"PO Box 5500",37864-5500
"Signal Mountain",Ms.,Jennifer,,Broomfield,,,"Jennifer Broomfield","Finance Director, Signal Mountain; Town Recorder, Signal Mountain","(423) 886-2177",205,,jbroomfield@signalmountaintn.gov,"1111 Ridgeway Avenue","Signal Mountain",TN,37377,,
Smyrna,Mr.,Rex,,Gaither,,,"Rex Gaither","Finance Director, Smyrna; Assistant Town Manager, Smyrna","(615) 267-5409",,,rex.gaither@townofsmyrna.org,"315 South Lowry Street",Smyrna,TN,37167,,
Somerville,Ms.,Amanda,,Stout,,,"Amanda Stout","Finance Director, Somerville","(901) 465-9500",,,astout@somervilletn.gov,"13085 N. Main Street, P.O. Box 909",Somerville,TN,38068,"P.O. Box 909",38068
"South Pittsburg",,Vacant,,Vacant,,,VACANT,"Finance Director, South Pittsburg; City Court Clerk, South Pittsburg","(423) 837-5012",,,,"204 W. 3rd Street","South Pittsburg",TN,37380,,
Sparta,Ms.,Tonia,R.,Wilson,,,"Tonia Wilson","Finance Director, Sparta","(931) 836-3248",,,t.wilson@spartatn.gov,"6 Liberty Square, PO Box 30",Sparta,TN,38583,,
"Spring Hill",Ms.,Debra,,Dutcher,,,"Debra Dutcher","Finance Director, Spring Hill","(931) 486-2252",263,,ddutcher@springhilltn.org,"199 Town Center Parkway","Spring Hill",TN,37174,,
Springfield,Ms.,Lisa,,Crockett,,,"Lisa Crockett","City Recorder, Springfield; Finance Director, Springfield","(615) 382-2200",,,Lisa.Crockett@springfieldtn.gov,"405 North Main Street, P.O. Box 788",Springfield,TN,37172,,
Tazewell,Mrs.,Robin,,Sorke,,,"Robin Sorke","City Recorder, Tazewell; CMFO, Tazewell","(423) 626-5104",,"(423) 626-0075",r.sorke@tazewelltn.net,"1830 Main Street",Tazewell,TN,37879,,
"Thompson's Station",Mr.,Steve,,Banks,,,"Steve Banks","Finance Director, Thompson's Station","(615) 794-4333",,,sbanks@thompsons-station.com,"1550 Thompson's Station Road West, P.O. Box 100","Thompson's Station",TN,37179,,
Tullahoma,Ms.,Susan,,Wilson,,,"Susan Wilson","Finance Director, Tullahoma","(931) 455-2648",,,swilson@tullahomatn.gov,"201 West Grundy Street, PO Box 807",Tullahoma,TN,37388,,
Watauga,Ms.,Monica,,Thomas,,,"Monica Thomas","City Manager, Watauga; Finance Director, Watauga","(423) 928-3490",,,cityofwatauga@gmail.com,"103 W. Fourth Avenue",Watauga,TN,37694,,
Waynesboro,Ms.,Lisa,,Calton,,,"Lisa Calton","Finance Director, Waynesboro","(931) 722-5458",,,,"122 Public Square East, P.O. Box 471",Waynesboro,TN,38485,,
Westmoreland,Ms.,Keshia,,Troutt,,,"Keshia Troutt","Finance Director, Westmoreland; City Recorder, Westmoreland","(615) 644-3850",,"(615) 644-3950",keshia.troutt@westmorelandtn.gov,"1001 Park Street, P.O. Box 8",Westmoreland,TN,37186,,
"White House",Mr.,Jason,,Barnes,,,"Jason Barnes","Finance Director, White House","(615) 672-4350",2103,,,"105-D College Street","White House",TN,37188,,
Winchester,Ms.,Vanessa,,Fults,,,"Vanessa Fults","Finance Officer, Winchester","(931) 967-2532",,,vanessafults@winchester-tn.com,"7 South High Street",Winchester,TN,37398,,