Organization,Salutation,First,Middle,Last,Generational,Credentials,"Preferred Name",Title,Phone,"Phone Extension",Fax,Email,Address,City,State,Zip,"Billing Address","Billing Zip"
Adams,Mr.,Wayne,,Evans,,,"Wayne Evans","Mayor, Adams","(615) 696-2593",,"(615) 696-2220",adamsmayor@adamstn.org,"7617 Highway 41 North, Suite 101",Adams,TN,37010,"PO Box 67",37010
Adamsville,Mr.,David,,Leckner,,,"David Leckner","Mayor, Adamsville","(731) 632-1401",,"(731) 632-1779",d.leckner@cityofadamsville.com,"231 East Main Street, P.O. Box 301",Adamsville,TN,38310,,
Alamo,Mr.,John,A.,Emison,,,"John A. Emison","Mayor, Alamo","(731) 696-4515",,,johnaveryemison@yahoo.com,"97 S. Johnson Street",Alamo,TN,38001,,
Alcoa,Ms.,Tanya,,Martin,,,"Tanya Martin","Mayor, Alcoa","(865) 380-4795",,,tmartin@cityofalcoa-tn.gov,"223 Associates Blvd.",Alcoa,TN,37701-1948,,
Alexandria,Mr.,Curtis,,Rutter,,,"Curtis Rutter","Mayor, Alexandria","(615) 529-2171",,,mayor.rutter@townofalexandria.us,"102 High Street, P.O. Box 277",Alexandria,TN,37012,,
Algood,Ms.,Lisa,,Chapman-Fowler,,,"Lisa Chapman-Fowler","Mayor, Algood","(931) 537-9545",,"(931) 537-9429",lisa.chapman-fowler@algoodtn.gov,"215 W. Main Street",Algood,TN,38506,,
Allardt,Ms.,Yvonne,,Gernt,,,"Yvonne Gernt","Mayor, Allardt","(931) 879-7125",,,,"2015 Michigan Avenue, PO Box 159",Allardt,TN,38504,,
Altamont,Mrs.,Jana,L.,Barrett,,,"Jana L. Barrett","Mayor, Altamont","(931) 692-3971",,"(931) 692-4027",janabarrett95@yahoo.com,"P. O. Box 200",Altamont,TN,37301,,
Ardmore,Mr.,Mike,,Magnusson,,,"Mike Magnusson","Mayor, Ardmore","(931) 427-2124",,,,"25844 Main Street",Ardmore,TN,38449,,
Arlington,Mr.,Mike,,Wissman,,,"Mike Wissman","Mayor, Arlington","(901) 867-2620",,,mwissman@townofarlington.org,"5854 Airline Road, PO BOX 507",Arlington,TN,38002,,
"Ashland City",Mr.,JT,,Smith,,,"JT Smith","Mayor, Ashland City","(615) 772-5612",,,jtsmith@ashlandcitytn.gov,"233 Tennessee Waltz Parkway, Suite 103","Ashland City",TN,37015,"PO Box 36",37015
Athens,Mr.,Steven,S.,Sherlin,,,"Steven Sherlin","Mayor, Athens","(423) 920-6649",,"(423) 744-8866",ssherlin@athenstn.gov,"815 North Jackson Street",Athens,TN,37303,,
Atoka,Mr.,Barry,L.,Akin,,,"Barry L. Akin","Mayor, Atoka","(901) 497-3901",,,,"44 W Cherryvark Dr.",Atoka,TN,38004,,
Atwood,Mr.,James,,Halford,Sr.,,"James Halford, Sr.","Mayor, Atwood","(731) 662-7689",,,,"P.O. Box 339",Atwood,TN,38220,,
Auburntown,Mr.,Roger,,Turney,,,"Roger Turney","Mayor, Auburntown","(615) 464-4210",,"(615) 464-4344",mayor@auburntown.org,"291 Knob Hill Road",Auburntown,TN,37016,,
Baileyton,Mr.,William,,Kerr,,,"William K. Kerr","Mayor, Baileyton","(423) 234-6911",,,baileytontownhall@gmail.com,"Town Hall, 6530 Horton Highway",Baileyton,TN,37745,,
Baneberry,Mrs.,Donna,,Hernandez,,,"Donna Hernandez","Mayor, Baneberry","(865) 674-0124",,,dhernandez@cityofbaneberry.com,"City Hall, 521 Harrison Ferry Road",Baneberry,TN,37890,,
Bartlett,Mr.,David,,Parsons,,,"David Parsons","Mayor, Bartlett","(901) 859-3381",,,dparsons@cityofbartlett.org,"6400 Stage Road",Bartlett,TN,38134-3739,,
Baxter,Mr.,John,,Martin,,,"John Martin","Mayor, Baxter","(931) 858-4111",,,,"399 First Ave N",Baxter,TN,38544,,
"Bean Station",Mr.,Ben,D.,Waller,,,"Ben Waller","Mayor, Bean Station","(865) 993-3177",,"(865) 993-3619",bwaller@townofbeanstation.com,"785 Main Street","Bean Station",TN,37708,,
"Beersheba Springs",Mr.,Jackie,,Eubanks,,,"Jackie Eubanks","Mayor, Beersheba Springs; Fire Chief, Beersheba Springs","(931) 235-3166",,,,"PO Box 36","Beersheba Springs",TN,37305,,
"Bell Buckle",Mr.,Ronnie,,Lokey,,,"Ronnie Lokey","Mayor, Bell Buckle","(931) 389-9513",,,ronnie_lokey@townofbellbuckle.com,"8 Railroad Square, PO Box 276","Bell Buckle",TN,37020,,
"Belle Meade",Mr.,Rusty,,Moore,,,"Rusty Moore","Mayor, Belle Meade","(615) 297-6041",,,rmoore@citybellemeade.org,"4705 Harding Pike","Belle Meade",TN,37205,,
Bells,Mr.,Eric,,Jordan,,,"Eric Jordan","Mayor, Bells","(731) 663-2334",,,bellsmayorjordan@yahoo.com,"12987 Hwy 79, P.O. Box 760",Bells,TN,38006,,
Benton,Mr.,Joe,,Jenkins,,,"Joe Jenkins","Mayor, Benton","(423) 338-5733",,,,"6496 HWY 411 North",Benton,TN,37307,,
"Berry Hill",Mr.,Dennis,,Sheffield,,,"Dennis Sheffield","Mayor, Berry Hill","(615) 292-5531",,"(615) 297-2391",dsheffield@berryhilltn.net,"698 Thompson Lane","Berry Hill",TN,37204,,
"Bethel Springs",Mr.,John,M.,Wood,,,"John M. Wood","Mayor, Bethel Springs","(731) 934-7266",,,,"4066 Main Street, P.O. Box 214","Bethel Springs",TN,38315,,
"Big Sandy",Mr.,John,,Clement,,,"John Clement","Mayor, Big Sandy","(731) 593-3213",,,mayortownofbigsandy@gmail.com,"65 Front Street","Big Sandy",TN,38221,"P.O. Box 176",38221
Blaine,Mr.,Marvin,,Braden,,,"Marvin Braden","Mayor, Blaine","(865) 933-1240",,,mayor.braden@blainetn.gov,"220 Indian Ridge Road; PO Box 85",Blaine,TN,37709,,
"Bluff City",Mr.,Jeff,,Broyles,,,"Jeff Broyles","Mayor, Bluff City; Town Manager, Bluff City","(276) 274-3548",,,jbroyles@bluffcitytn.gov,"660 Kentucky Ave.","Bluff City",TN,37618,,
Bolivar,Mr.,Julian,,McTizic,,,"Julian McTizic","Mayor, Bolivar","(731) 658-2020",,,,"City Hall, 211 North Washington Street",Bolivar,TN,38008,,
Braden,Mr.,Chester,,Cocke,,,"Chester Cocke","Mayor, Braden","(901) 594-5100",,,,"Town Hall; PO Box 1350",Braden,TN,38010,"PO Box 1350",38010
Bradford,Mr.,Dwayne,,Reynolds,,,"Dwayne Reynolds","Mayor, Bradford","(731) 742-3465",,"(731) 742-2969",,"PO Box 87",Bradford,TN,38316,,
Brentwood,Mr.,Mark,W.,Gorman,,,"Mark W. Gorman","Mayor, Brentwood","(615) 371-0060",,"(615) 371-2215",mark.gorman@brentwoodtn.gov,"5211 Maryland Way, P.O. Box 788",Brentwood,TN,37024-0788,,
Brighton,Ms.,Stephanie,,Chapman-Washam,,,"Stephanie Chapman-Washam","Mayor, Brighton","(901) 476-8661",,"(901) 475-9983",mayor@townofbrighton.com,"139 North Main,P. O. Box 277",Brighton,TN,38011,,
Bristol,Mr.,Vince,,Turner,,,"Vince Turner","Mayor, Bristol","(423) 989-5545",,,vturner@bristoltn.org,"801 Anderson St., PO Box 1189",Bristol,TN,37621-1189,"PO Box 1189",37621-1189
Brownsville,Mr.,William,,"Rawls, Jr.",,,"William ""Bill"" Rawls, Jr.","Mayor, Brownsville","(731) 772-1212",,,wrawls@brownsvilletn.gov,"111 North Washington, P.O. Box 449",Brownsville,TN,38012,,
Bruceton,Mr.,Robert,T.,"Keeton, III",,,"Robert T. Keeton, III","Mayor, Bruceton","(731) 586-2401",,,,"209 Cheatham Street",Bruceton,TN,38317,,
"Bulls Gap",Mr.,M,Stacy,Hayes,,,"Stacy Hayes","Mayor, Bulls Gap","(423) 235-5216",,"(423) 235-0078",stacy.bullsgap@gmail.com,"139 S Main St, PO Box 10","Bulls Gap",TN,37711,,
Burlison,Mr.,James,,Kenny,,,"James Kenny","Mayor, Burlison","(901) 475-9068",,,townofburlison@att.net,"P. O. Box 150",Burlison,TN,38015,,
Burns,Mr.,Landon,,Mathis,,,"Landon Mathis","Mayor, Burns","(615) 566-2801",,,themathiscompany@gmail.com,"P.O. Box 36",Burns,TN,37029,,
Byrdstown,Mr.,Sam,,Gibson,,,"Sam Gibson","Mayor, Byrdstown","(931) 864-6215",,"(931) 864-6120",,"109 West Main,P. O. Box 325",Byrdstown,TN,38549,,
Calhoun,Mr.,John,,Walker,,,"John Walker","Mayor, Calhoun","(423) 336-2348",,,,"746 Highway 163, P.O. Box 115",Calhoun,TN,37309,,
Camden,Mr.,Roger,G.,Pafford,,,"Roger G. Pafford","Mayor, Camden","(731) 584-4656",,"(731) 584-1781",cityofcamden1@bellsouth.net,"110 Highway 641 South, P.O. Box 779",Camden,TN,38320,,
Carthage,Mr.,Stephen,Marie,Babcock,,,"Stephen ""Steve"" Babcock","Mayor, Carthage","(615) 735-1881",203,"(615) 735-3475",mayorbabcock@townofcarthagetn.gov,"314 Spring Street, P.O. Box 259",Carthage,TN,37030,,
Caryville,Mr.,Robert,L.,Stooksbury,,,"Robert L. Stooksbury","Mayor, Caryville","(423) 562-9478",,,,"4839 Old Highway 63",Caryville,TN,37714,,
"Cedar Hill",Mr.,John,,Edwards,,,"John Edwards","Mayor, Cedar Hill","(615) 696-4802",,,,"P.O. Box 113","Cedar Hill",TN,37032,,
Celina,Mr.,Luke,,Collins,,,"Luke Collins","Mayor, Celina","(931) 243-2115",,,celinamayor@twlakes.net,"330 Dow Avenue, P.O. Box 449",Celina,TN,38551,,
Centertown,Mr.,Joel,,Akers,,,"Joel Akers","Mayor, Centertown","(931) 939-2630",,,mayorakers@benlomand.net,"P.O. Box 164",McMinnville,TN,37111-0164,,
Centerville,Mr.,Gary,,Jacobs,,,"Gary Jacobs","Mayor, Centerville","(615) 418-4718",,,mayor@centervilletn.org,"954 Riverview Road",Centerville,TN,37033,,
"Chapel Hill",Mr.,Mike,,Faulkenberry,,,"Mike Faulkenberry","Mayor, Chapel Hill","(931) 364-7632",,,,"4650 Nashville Hwy, PO Box 157","Chapel Hill",TN,37034,,
Charleston,Ms.,Donna,,McDermott,,,"Donna McDermott","Mayor, Charleston","(423) 336-1483",,"(423) -6607",donnam7777@gmail.com,"126 Worth Street, NE, PO Box 431",Charleston,TN,37310,,
Charlotte,Mr.,Garland,,Breeden,,,"Garland Breeden","Mayor, Charlotte","(615) 789-4184",,,,"22 Court Square",Charlotte,TN,37036,,
Chattanooga,Mr.,Tim,,Kelly,,,"Tim Kelly","Mayor, Chattanooga","(423) 643-7800",,,mayor@chattanooga.gov,"City Hall, 101 East 11th Street",Chattanooga,TN,37402,,
"Church Hill",Mr.,Dennis,,Deal,,,"Dennis Deal","Mayor, Church Hill","(423) 357-6161",,,,"300 E. Main Boulevard, P.O. Box 366","Church Hill",TN,37642,,
Clarksburg,Mr.,"Howell Wayne",,Todd,,,"Howell Wayne Todd","Mayor, Clarksburg","(731) 986-5547",,"(731) 986-5575",mayor.clarksburg@gmail.com,"P.O. Box 117",Clarksburg,TN,38324-0117,,
Clarksville,Mr.,Joe,,Pitts,,,"Joe Pitts","Mayor, Clarksville","(931) 645-7444",,,joe.pitts@cityofclarksville.com,"1 Public Square, PO Box 928",Clarksville,TN,37040,,
Cleveland,Mr.,Kevine,,Brooks,,,"Kevin Brooks","Mayor, Cleveland","(423) 476-8931",,,kbrooks@clevelandtn.gov,"190 Church Street NE, P.O. Box 1519",Cleveland,TN,37364-1519,,
Clifton,Mr.,Mark,,Staggs,,,"Mark Staggs","Mayor, Clifton","(931) 676-3370",,,markbcc38485@yahoo.com,"142 Main Street, P.O. Box 192",Clifton,TN,38425,,
Clinton,Mr.,Scott,,Burton,,,"Scott Burton","Mayor, Clinton","(865) 457-0424",,,sburton@clintontn.net,"100 Bowling Street",Clinton,TN,37716,,
Coalmont,Mr.,Thomas,H.,Meeks,,,"Thomas H. Meeks","Mayor, Coalmont","(931) 580-9424",,,Tmeeks1949@hotmail.com,"Highway 56",Coalmont,TN,37313,"PO Box 308",37313
Collegedale,Mr.,Morty,,Lloyd,,,"Morty Lloyd","Mayor, Collegedale","(423) 396-3135",,"(423) 396-3135",mlloyd@collegedaletn.gov,"4910 Swinyar Drive, P.O. Box 1880",Collegedale,TN,37315-1880,,
Collierville,Mr.,Stan,,Joyner,,,"Stan Joyner","Mayor, Collierville","(901) 457-2200",,,sjoyner@colliervilletn.gov,"500 Poplar View Parkway",Collierville,TN,38017-3440,,
Collinwood,Mr.,James,G.,Brown,,,"James G. Brown","Mayor, Collinwood","(931) 724-9107",,,,"101 Third Avenue No, P.O. Box 98",Collinwood,TN,38450,,
Columbia,Mr.,Chaz,,Molder,,,"Chaz Molder","Mayor, Columbia","(931) 560-1505",,,chaz.molder@columbiatn.com,"700 North Garden Street",Columbia,TN,38401,,
Cookeville,Ms.,Laurin,,Wheaton,,,"Laurin Wheaton","Mayor, Cookeville","(931) 526-9591",,,lwheaton@cookeville-tn.gov,"45 East Broad Street, PO Box 998",Cookeville,TN,38501-0998,,
Coopertown,Mrs.,Becca,,Werner,,,"Becca Werner","Mayor, Coopertown","(615) 382-4470",216,"(615) 382-4439",mayor@coopertowntn.org,"2525 Burgess Gower Rd",Coopertown,TN,37172,,
Copperhill,Mrs.,Kathy,,Stewart,,,"Kathy Stewart","Mayor, Copperhill","(423) 496-5141",,"(423) 496-3617",cityofcopperhilltn@gmail.com,"160 Main Street, P.O. Box 640",Copperhill,TN,37317,,
Cornersville,Mr.,John,M,Luna,,,"John M Luna","Mayor, Cornersville","(931) 675-2997",,,cornersvillemayor@gmail.com,"P.O. Box 128",Cornersville,TN,37047,,
"Cottage Grove",Mr.,Gary,,McCaig,,,"Gary McCaig","Mayor, Cottage Grove","(863) 812-0134",,,mccaig9@gmail.com,"P.O. Box 26","Cottage Grove",TN,38224,,
Covington,Mr.,Jan,,Hensley,,,"Jan Hensley","Mayor, Covington","(901) 476-9613",,,jhensley@covingtontn.com,"200 West Washington Ave., P.O. Box 768",Covington,TN,38019-0768,,
Cowan,Mr.,Richard,,Hunt,,,"Richard Hunt","Mayor, Cowan","(931) 967-7318",,,,"301 East Cumberland, P.O. Box 338",Cowan,TN,37318,,
"Crab Orchard",Mr.,Emmett,,Sherrill,,,"Emmett Sherrill","Mayor, Crab Orchard","(931) 484-2815",,,,"338 Hebbertsburg Road, P.O. Box 215","Crab Orchard",TN,37723,,
"Cross Plains",Mr.,Barry,,Faulkner,,,"Barry Faulkner","Mayor, Cross Plains","(615) 654-2555",,,,"7622 Hwy 25 East","Cross Plains",TN,37049,,
Crossville,Dr.,R.J.,,Crawford,,,"R.J. Crawford","Mayor, Crossville","(931) 484-5113",,,rj.crawford@crossvilletn.gov,"392 N Main Street",Crossville,TN,38555,,
Crump,Mr.,Ricky,,Tuberville,,,"Ricky Tuberville","Mayor, Crump","(731) 632-4224",,"(731) 632-0644",crumpcityhall@yahoo.com,"3020 Highway 64",Crump,TN,38327,,
"Cumberland City",Mr.,Gary,,Vaughn,,,"Gary Vaughn","Mayor, Cumberland City","(931) 827-2000",,,,"121 Main Street","Cumberland City",TN,37050,"P.O. Box 40",37050
"Cumberland Gap",Mr.,Neal,,Pucciarelli,,,"Neal Pucciarelli","Mayor, Cumberland Gap","(423) 869-3860",,,,"330 Colwyn Street, P.O. Box 78","Cumberland Gap",TN,37724,,
Dandridge,Mr.,George,,Gantte,,,"George Gantte","Mayor, Dandridge","(865) 397-7420",,,ggantte@dandridgetn.gov,"131 East Main Street, P.O. Box 249",Dandridge,TN,37725,,
Dayton,Mr.,Hurley,,Marsh,,,"Hurley Marsh","Mayor, Dayton","(423) 775-1817",,,h.marsh@daytontn.net,"399 First Avenue",Dayton,TN,37321,"P.O. Box 226",37321
Decatur,Mr.,John,Wayne,Irwin,,,"John Wayne Irwin","Mayor, Decatur","(423) 334-5716",,,,"116 North Main Street",Decatur,TN,37322,,
Decaturville,Mr.,Tim,,Grace,,,"Tim Grace","Mayor, Decaturville","(731) 852-2034",,,,"PO Box 159",Decaturville,TN,38329,,
Decherd,Ms.,"Mary Nell",,Hess,,,"Mary Nell Hess","Mayor, Decherd","(931) 636-3497",,,marynell.hess@decherdtn.gov,"1301 West Main, P.O. Box 488",Decherd,TN,37324,,
Dickson,Dr.,Don,L.,Weiss,Jr.,,"Don L. Weiss, Jr.","Mayor, Dickson","(615) 441-9508",,,mayor@cityofdickson.com,"600 East Walnut Street",Dickson,TN,37055,,
Dover,Ms.,Lesa,,Fitzhugh,,,"Lesa Fitzhugh","Mayor, Dover","(931) 232-5907",,,Mayor@dovertn.com,"P.O. Box 447",Dover,TN,37058,,
Dowelltown,Ms.,Pam,,Redmon,,,"Pam Redmon","Mayor, Dowelltown","(615) 536-5997",,,cityofdowelltown@gmail.com,"P.O. Box 100",Dowelltown,TN,37059,,
Doyle,Mr.,Ray,,Spivey,,,"Ray Spivey","Mayor, Doyle","(931) 657-2459",,,townofdoyle@yahoo.com,"158 Womack Street",Doyle,TN,38559,,
Dresden,Mr.,Mark,,Maddox,,,"Mark Maddox","Mayor, Dresden","(731) 364-2270",,,mayor@cityofdresden.net,"589 Evergreen Street",Dresden,TN,38225,,
Ducktown,Mr.,Doug,,Collins,,,"Doug Collins","Mayor, Ducktown","(423) 496-3546",,,ddcollins@outlook.com,"1646 Hwy 68N",Ducktown,TN,37326,,
Dunlap,Mr.,Clinton,P.,Huth,,,"Clinton P. Huth","Mayor, Dunlap","(423) 949-2115",,,mayorhuth@cityofdunlap.com,"15595 Rankin Avenue, P.O. Box 546",Dunlap,TN,37327,,
Dyer,Mr.,Chris,,Younger,,,"Chris Younger","Mayor, Dyer","(731) 692-3767",,,,"105 South Main Street",Dyer,TN,38330,,
Dyersburg,Mr.,John,,Holden,,,"John Holden","Mayor, Dyersburg","(731) 286-7604",,,jholden@dyersburgtn.gov,"425 West Court Street",Dyersburg,TN,38025-1358,"PO Box 1358",38025
Eagleville,Mr.,Chad,,Leeman,,,"Chad Leeman","Mayor, Eagleville","(615) 274-2922",,,mayorleeman@eaglevilletn.gov,"108 South Main Street; PO Box 68",Eagleville,TN,37060,"PO Box 68",37060
"East Ridge",Mr.,Brian,,Williams,,,"Brian Williams","Mayor, East Ridge","(423) 867-7711",,"(423) 867-2806",bwilliams@eastridgetn.gov,"1517 Tombras Avenue","East Ridge",TN,37412,,
Eastview,Mr.,Elvis,,Butler,,,"Elvis Butler","Mayor, Eastview; Fire Chief, Eastview","(731) 645-3428",,,,"199 Hwy 57",Eastview,TN,38367,,
Elizabethton,Mr.,Curt,,Alexander,,,"Curt Alexander","Mayor, Elizabethton","(423) 547-6200",,,curt.alexander@edwardjones.com,"137 S. Sycamore Street; Mayor Curt Alexander; c/o City Manager's Office",Elizabethton,TN,37643,,
Elkton,Mr.,Ryan,,Gilland,,,"Ryan Gilland","Mayor, Elkton","(931) 468-2506",,,,"168 Main Street, P.O. Box 157",Elkton,TN,38455-0157,,
Englewood,Mr.,Tony,,Hawn,,,"Tony Hawn","Mayor, Englewood","(423) 887-7224",,,,"111 So. Niota Road, P.O. Box 150",Englewood,TN,37329,,
Enville,Ms.,Melinda,,Johnston,,,"Melinda Johnston","Mayor, Enville","(731) 607-1390",,,envilletn@gmail.com,"PO Box 177",Enville,TN,38332,,
Erin,Mr.,Paul,,Bailey,,,"Paul Bailey","Mayor, Erin","(931) 289-4108",,"(931) 289-5436",,"15 Hill Street,P. O. Box 270",Erin,TN,37061,,
Erwin,Mr.,"Dwight ""Glenn""",,White,,,"Dwight ""Glenn"" White","Mayor, Erwin","(423) 743-6231",,"(423) 743-3983",mayor@erwintn.org,"PO Box 59",Erwin,TN,37650,,
"Estill Springs",Mr.,"James David",,Kelley,,,"James David Kelley","Mayor, Estill Springs","(931) 649-5188",,,,"PO Box 100","Estill Springs",TN,37330,,
Ethridge,Mr.,Dallas,,Luna,,,"Dallas Luna","Mayor, Ethridge","(931) 829-2150",,,,"P.O. Box 173",Ethridge,TN,38456,,
Etowah,Mr.,Burke,,Garwood,,,"Burke Garwood","Mayor, Etowah","(423) 263-2202",,,,"Etowah City Hall, 701 Tennessee Ave.",Etowah,TN,37331-1345,,
Fairview,Ms.,Lisa,,Anderson,,,"Lisa Anderson","Mayor, Fairview","(629) 277-0090",,,mayoranderson@fairview-tn.org,"7100 City Center Way, P.O. Box 69",Fairview,TN,37062,,
Farragut,Mr.,Ron,,Williams,,,"Ron Williams","Mayor, Farragut","(865) 966-7057",,"(865) 675-2096",rwilliams@townoffarragut.org,"11408 Municipal Center Drive",Farragut,TN,37934,,
Fayetteville,Ms.,Donna,,Hartman,,,"Donna Hartman","Mayor, Fayetteville","(931) 433-6154",,"(931) 433-2557",dhartman@cof-tn.com,"110 Elk Avenue South",Fayetteville,TN,37334,,
Finger,Mr.,Cody,,Moss,,,"Cody Moss","Mayor, Finger","(731) 934-4677",,,,"2234A Finger Leapwood Road",Finger,TN,38334,,
"Forest Hills",Mr.,Lanson,,"Hyde III",,,"Lanson Hyde III","Mayor, Forest Hills","(615) 372-8677",,,ljhyde3@yahoo.com,"6300 Hillsboro Pike","Forest Hills",TN,37215,,
Franklin,Dr.,Ken,,Moore,,,"Ken Moore","Mayor, Franklin","(615) 791-3217",,"(615) 790-0469",ken.moore@franklintn.gov,"109 Third AV South",Franklin,TN,37064,,
Friendship,Mr.,Casey,,Burnett,,,"Casey Burnett","Mayor, Friendship; City Judge, Friendship; Fire Chief, Friendship","(731) 677-2310",,,,"631 Main Street, P.O. Box 265",Friendship,TN,38034,,
Friendsville,Mr.,Steven,,Cardwell,,,"Steven Cardwell","Mayor, Friendsville","(865) 995-2831",1,,mayor@friendsvilletn.gov,"213 W. College Avenue, P.O. Box 56",Friendsville,TN,37737,,
Gadsden,Mr.,Randall,,Smith,,,"Randall ""Randy"" Smith","Mayor, Gadsden","(731) 784-2235",,,gadsdenmayor@yahoo.com,"229 High Street",Gadsden,TN,38337,"PO Box 158",38337
Gainesboro,Mr.,Lloyd,F.,Williams,,,"Lloyd F. Williams","Mayor, Gainesboro","(931) 268-9315",,"(931) 268-3540",,"P. O. Box 594,402 East Hull Avenue",Gainesboro,TN,38562,,
Gallatin,Ms.,Paige,,Brown,,,"Paige Brown","Mayor, Gallatin","(615) 451-5895",,,paige.brown@gallatintn.gov,"132 West Main Street",Gallatin,TN,37066,,
Gallaway,Mr.,"William Bill",,Mayo,,,"Jamie Mayo","Mayor, Gallaway","(901) 867-3333",,,,"333 Old Brownsville Road",Gallaway,TN,38036,,
Garland,Mrs.,Kelley,,Gray,,,"Kelley Gray","Mayor, Garland","(901) 355-5741",,,,"PO Box 147",Garland,TN,38015,,
Gates,Mr.,Dwayne,,Dixon,,,"Dwayne Dixon","Mayor, Gates","(731) 836-7501",,,townofgates@gowisper.net,"10085 2nd Street, PO Box 129",Gates,TN,38037,,
Gatlinburg,Mr.,Mike,,Werner,,,"Mike Werner","Mayor, Gatlinburg","(865) 436-1400",,,mwerner@gatlinburgtn.gov,"1230 East Parkway",Gatlinburg,TN,37738,,
Germantown,Mr.,Mike,,Palazzolo,,,"Mike Palazzolo","Mayor, Germantown","(901) 757-7252",,,mpalazzolo@germantown-tn.gov,"1930 South Germantown Rd",Germantown,TN,38138,,
Gibson,Mr.,Jim,,Hill,,,"Jim ""Jimmie"" Hill","Mayor, Gibson","(731) 787-6501",,,,"2202 Gibson Square, P.O. Box 374",Gibson,TN,38338,,
"Gilt Edge",Mr.,"W. Stephen",,Fletcher,,,"W. Stephen ""Steve"" Fletcher","Mayor, Gilt Edge","(901) 476-9402",,,sfgiltedge@aol.com,"P.O. Box 123","Gilt Edge",TN,38015,,
Gleason,Mr.,Charles,,Anderson,,,"Charles Anderson","Mayor, Gleason","(731) 648-5547",,,ceander1952@gmail.com,"101 College Street, PO Box 720",Gleason,TN,38229,,
Goodlettsville,Mr.,Rusty,,Tinnin,,,"Rusty Tinnin","Mayor, Goodlettsville","(615) 851-2200",,"(615) 851-2212",tinninr@yahoo.com,"105 South Main Street",Goodlettsville,TN,37072,,
Gordonsville,Mr.,John,,Potts,,,"John Potts","Mayor, Gordonsville","(615) 683-8282",,,mayor@townofgordonsville.com,"63 E. Main Street",Gordonsville,TN,38563,,
"Grand Junction",Mr.,Curtis,,Lane,,,"Curtis Lane","Mayor, Grand Junction","(731) 764-2871",,,mayor@grandjunctiontn.com,"150 Tippah St.","Grand Junction",TN,38039,"PO Box 129",38039
Graysville,Mr.,Charles,,Kaylor,,,"Charles Kaylor","Mayor, Graysville","(423) 775-9242",,"(423) 775-8137",,"136 Harrison Avenue",Graysville,TN,37338,,
Greenback,Mr.,Dewayne,,Birchfield,,,"Dewayne Birchfield","Mayor, Greenback","(865) 856-2224",,,,"6889 Morganton Road, P.O. Box 140",Greenback,TN,37742,,
Greenbrier,Mr.,Lanny,,Adcock,,,"Lanny Adcock","Mayor, Greenbrier","(615) 643-4531",,,cityofgreenbrier@greenbriertn.org,"2414 Hwy 41 S",Greenbrier,TN,37073,,
Greeneville,Mr.,Cal,,Doty,,,"Cal Doty","Mayor, Greeneville","(423) 787-6380",,,,"200 North College Street",Greeneville,TN,37745,,
Greenfield,Ms.,Cindy,,McAdams,,,"Cindy McAdams","Mayor, Greenfield","(731) 235-2330",,,cityofgreenfield@charter.net,"302 North Front Street",Greenfield,TN,38230,,
Gruetli-Laager,Mr.,Kelly,,Gibbs,,,"Kelly Gibbs","Mayor, Gruetli-Laager","(931) 779-5147",,"(931) 779-5165",glcityhall@yahoo.com,"460 South 40th Ave.",Gruetli-Laager,TN,37339,,
Guys,Mr.,Keith,,Rinehart,,,"Keith Rinehart","Mayor, Guys; Treasurer, Guys","(731) 239-4700",,,,"P.O. Box 122",Guys,TN,38339,,
Halls,Mr.,Eugene,,Pugh,,,"Eugene Pugh","Mayor, Halls","(731) 836-9653",,,tlewis@town.halls.tn.us,"524 West Tigrett Street",Halls,TN,38040,,
Harriman,Mr.,Wayne,,Best,,,"Wayne Best","Mayor, Harriman","(865) 388-9693",,"(865) 882-7031",wayne.best@cityofharriman.net,"609 N. Roane Street,P.O. Drawer 433",Harriman,TN,37748,,
Harrogate,Mr.,Troy,,Poore,,,"Troy Poore","Mayor, Harrogate","(423) 869-0211",,,,"138 Harrogate Crossing, P.O. Box 979",Harrogate,TN,37752,,
Hartsville,Mr.,Jack,B,McCall,,,"Jack E. McCall","Mayor, Hartsville","(615) 374-2461",,"(615) 374-3948",JMcCall@trousdalecountytn.gov,"328 Broadway, Room 6",Hartsville,TN,37074,,
Henderson,Mr.,"Robert W.",,King,,,"Robert ""Bobby"" W. King","Mayor, Henderson","(731) 983-5000",,,bking@hendersontn.gov,"121 Crook Avenue",Henderson,TN,38340,"PO Box 68",38340
Hendersonville,Mr.,Jamie,,Clary,,,"Jamie Clary","Mayor, Hendersonville","(615) 822-1000",,,jclary@hvilletn.org,"101 Maple Drive North",Hendersonville,TN,37075,,
Henning,Mr.,Quenton,,Reed,,,"Quenton Reed","Mayor, Henning","(731) 612-6736",,,,"PO Box 488",Henning,TN,38041,,
Henry,Mr.,Dustin,,Odom,,,"Dustin Odom","Mayor, Henry","(731) 241-0163",,,,"1232 Pioneer Road",Henry,TN,38231,,
"Hickory Valley",Mr.,Richard,,Ayers,,,"Richard Ayers","Mayor, Hickory Valley","(731) 659-2514",,,,"7115 Hwy 18 S  P.O. Box 39","Hickory Valley",TN,38042,"P.O. Box 39",38042
Hohenwald,Mr.,Danny,,McKnight,,,"Danny McKnight","Mayor, Hohenwald","(931) 796-2231",,,dmcknight@hohenwald.com,"118 West Linden Avenue",Hohenwald,TN,38462,,
"Hollow Rock",Mr.,Bobby,,Brotherton,,,"Bobby Brotherton","Mayor, Hollow Rock","(731) 586-7773",,,,"27960 Broad St., P.O. Box 247","Hollow Rock",TN,38342,,
Hornbeak,Mrs.,Betty,Mae,Walley,,,"Betty Mae Walley","Mayor, Hornbeak","(731) 538-2799",,,hornbeakmayor@outlook.com,"PO Box 265",Hornbeak,TN,38232,,
Hornsby,Mr.,Curtis,,Vandiver,,,"Curtis Vandiver","Mayor, Hornsby","(731) 609-1281",,,,"164 Union Avenue",Hornsby,TN,38301,,
Humboldt,Mr.,Marvin,,Sikes,,,"Marvin Sikes","Mayor, Humboldt","(731) 784-2511",,,mayorsikes@gmail.com,"1201 Main Street",Humboldt,TN,38343,,
Huntingdon,Ms.,Nina,,Smothers,,,"Nina Smothers","Mayor, Huntingdon","(731) 986-2900",,"(731) 986-2919",huntingdoncityhall@huntingdonch.com,"19810 East Main St., P.O. Box 668",Huntingdon,TN,38344,,
Huntland,Mr.,Dolton,,Steele,,,"Dolton Steele","Mayor, Huntland","(931) 469-0283",,,,"100 Banks Street, P.O. Drawer H",Huntland,TN,37345,,
Huntsville,Mr.,"J. Dennis",,Jeffers,,,"J. Dennis Jeffers","Mayor, Huntsville","(423) 663-3471",,,djeffersmayor@highland.net,"P.O. Box 150",Huntsville,TN,37756,,
Jacksboro,Mrs.,June,,Forstner,,,"June Forstner","Mayor, Jacksboro","(423) 562-9312",,,mayor@jacksboro.org,"585 Main Street",Jacksboro,TN,37757,,
Jackson,Mr.,Scott,,Conger,,,"Scott Conger","Mayor, Jackson","(731) 425-8240",,"(731) 425-8605",mayor@jacksontn.gov,"121 E. Main Street, Suite 301",Jackson,TN,38301,,